Webkit Build Error


RECOMMENDED: If you have Windows errors then we strongly recommend that you download and run this (Windows) Repair Tool.

Click on a swatch to set the color of the selected key(s), or Ctrl+Click to set the text color. You can also drag color swatches to individual legends to set.

Sass (Syntactically Awesome StyleSheets) Table of contents :toc; Sass is an extension of CSS that adds power and elegance to the basic language. It allows you to use.

Akonadi Error Mysql. mysql.conf", "–datadir=/home/fld/.local/share/akonadi/db_data/", "–socket=/tmp/akonadi-fld.T7GgAn/mysql.socket") stdout: "" stderr: "/usr/sbin/mysqld: Error on realpath() on ‘/var/lib/mysql-files’ (Error 2) 161107 13:16:09 [ERROR]. Error Mod Authnz Ldap Requires Apr Util Jun 6, 2015. CAS 3.4.3.1

Unreviewed build fix after r221017. – Correct copy/paste error. * WebCoreSupport/WebPlatformStrategies.cpp: (WebPlatformStrategies::cookiesForDOM): git-svn-id: http://svn.webkit.org/repository/webkit/[email protected] 268f45cc-cd09-0410-ab3c-d52691b4dbfc

Jun 16, 2009  · Description Resource Path Location Type; The type java.lang.Object cannot be resolved. It is indirectly referenced from required.class files: MyClass.java

Otter Browser aims to recreate the best aspects of the classic Opera (12.x) UI using Qt5.

Node – Log stuff you want nw.on(‘log’, function (msg) { gutil.log(‘node-webkit-builder’, msg); }); // Build returns a promise, return it so the task isn’t called in parallel return nw.build().catch(function (err) { gutil.log(‘node-webkit-builder’, err);

{console.error(error); }); build also supports callbacks: nw.build(function(err). options.files Required. Type: String Default value: null. The path to your node webkit app.

World Wide Web DOI 10.1007/s11280-017-0458-9 An automatically vetting mechanism for SSL error-handling vulnerability in android hybrid Web apps Yang Liu1 ·Chaoshun.

. for `pop’ >> make[2]: *** [JavaScriptCore/jit/libJavaScriptCore_la-JITArithmetic.lo] >> Error 1 >> make[2]: Leaving directory `/build/buildd/webkit-1.1.6/build’ >> make[1]: *** [all] Error 2 >> make[1]: Leaving directory.

Aug 3, 2011. ERROR: Error installing capybara-webkit: ERROR: Failed to build gem native extension.. cannot install. error compiling from source #224.

However, the attempted build of webkit2-gtk fails with an error message. The line from the logfile reporting the error is

Apr 15, 2015. Probably you missed compilation of webkit while compilation of Qt. Read here how to resolve this issue:.

Mar 02, 2017 · my_app$ gem install capybara-webkit Building native extensions. ERROR: Error installing capybara-webkit: ERROR: Failed to build gem native extension. /

# build-webkit –wincairo Checking Last-Modified date of WinCairoRequirements.zip. If all goes well, you should get no error and everything should build successfully.

Oct 12, 2016. Contribute to webkit2gtk-ARM development by creating an account on GitHub.

You need qmake, which comes from QT (a dependency of capybara-webkit). The capybara-webkit wiki has instructions for installing Qt and capybara-webkit on various systems: https.

Then point the WEBKIT_TESTFONTS environment variable to that directory when running run-webkit-tests. Problems with Python auto-update. You may encounter errors when the build.

build-webkit –debug. By default, build-webkit places build products in WebKitBuild. Otherwise you will see the error message: target specifies product type.

Cross-origin resource sharing (CORS) is a mechanism that allows restricted resources (e.g. fonts) on a web page to be requested from another domain outside the domain.

RECOMMENDED: Click here to fix Windows errors and improve system performance