Error C2664 Const

RECOMMENDED: If you have Windows errors then we strongly recommend that you download and run this (Windows) Repair Tool.

[QTBUG-31882] Qt 4.8.5 doesn't compile with VC11 (VS2012) – Qt. – Jun 20, 2013. : error C2664: 'std::pair<_Ty1,_Ty2>::pair(const std::pair< _Ty1,_Ty2> &)' : cannot convert parameter 1 from.

Ogre Forums • View topic – can't convert const char *(__cdecl. – Error 1 error C2664: 'const char *TiXmlElement::Attribute(const char *) const' : cannot convert parameter 1 from 'const char *(__cdecl *)(void)' to.

Error Python-devel Conflicts With Python Error Correction Communicative Language Teaching When I came across his error, my heart gave a little sigh. meaning you obviously intend and sucks generosity from the act of communication. I

I have a C++/Win32/MFC project in Visual Studio 2008, and I'm getting a strange error message when I compile it. I've created a small project to demonstrate the.

Feb 14, 2013  · Hi I am doing a project, which requires me to create a program which would calibrate the camera. I need help as i have.

boost_1_56_0boostbimapcontainer_adaptorassociative_container_adaptor. hpp(161): error C2664: 'const std::basic_string<_Elem,_Traits,_Ax>.

This guide will also be maintained on my blog INTRODUCTION In this project I have.

I am using Visual C++ 2008’s GUI creator to make a user interface. When a button is clicked, the following function is called. The content is supposed to create a.

The next sample demonstrates C2664 by using a string literal to call Test, and shows how to fix it. Because the parameter is an szString reference, an object must be.

Apr 29, 2014  · You’ve got a circular dependency between PoliceOfficer and ParkedCar.

Learn what callback functions are, what they help us achieve, and how to use them.

Gears Of War 2 Matchmaking Error The home of Gears of War brought. or join the latest forum discussions with other avid Gears fans. Read on for details on Ranked Season 2 and matchmaking. Your trade-in

cannot convert parameter 1 from 'char' to 'LPCWSTR' 2. Cannot convert parameter from 'const char[20]' to 'LPCWSTR' 616. How to convert a char to a String? 2529.

Error While Loading Shared Libraries * I installed ARB in my pc.while running arb below error is occur. – arb_ntree: error while loading shared libraries: cannot open Hello, Looking at the log file: /u01/app01/oracle_iAS_10g_new3/bin/rwserver:

RECOMMENDED: Click here to fix Windows errors and improve system performance